Proj_name,INP_RTF,NON_RTF,BGC_RTF,PRO_RTF,KNB_RTF,STS_RTF,USR_RTF,INP_CSV,NON_CSV,BGC_CSV,PRO_CSV,ECP_CSV,STS_CSV,ECI_MDB,ECI_XLS,USR_CSV,BGC_e00,ECP_e00,STS_e00,ECI_e00,Geog_loc,org_name,trim_nbr,ESIL,Date_rec,recor_name,pack_nbr,Pem_sup,GIS_sup,knb_sup,accuracy,pho_yr,pho_sc,pho_type
Okanagan TSA PEM Compilation Project 2010,pem_5511_inp,,pem_5511_bgc,pem_5511_pro,pem_5511_kb01,pem_5511_sts,pem_5511_usr.rtf,pem_5511_inp.csv,,pem_5511_bgc,pem_5511_mta,pem_5511_ecp,pem_5511_sts,pem_5511_eci_drybelt.mdb,pem_5511_drybelt_eci.csv,pem_5511_usr.csv,pem_5511_bgc.e00,pem_5511_ecp,pem_5511_sts,pem_5511_eci_drybeltsibec.e00,Okanagan TSA ,Timberline Natural Resource Group,1,2P,3/5/2010,M. Ketcheson,5,Maureen Ketcheson,Brian Calder,Maureen Ketcheson,4,2002,30000,3
,,,,,pem_5511_kb02,,,,,,,,,pem_5511_eci_drybelt_sibec.mdb,pem_5511_wetbelt_eci.csv,,,,,pem_5511_eci_drybelt.e00,,,,,,,,,,,,,,
,,,,,pem_5511_kb03,,,,,,,,,pem_5511_eci_wetbelt.mdb,pem_5511_verydrybelt_eci.csv,,,,,pem_5511_eci_verydry07.e00,,,,,,,,,,,,,,
,,,,,pem_5511_kb04,,,,,,,,,pem_5511_eci_verydry07_.mdb,,,,,,pem_5511_eci_verydry08.e00,,,,,,,,,,,,,,
,,,,,pem_5511_kb05,,,,,,,,,pem_5511_verydry08_eci.mdb,,,,,,pem_5511_eci_wetbelt.e00,,,,,,,,,,,,,,
,,,,,pem_5511_kb06,,,,,,,,,,,,,,,,,,,,,,,,,,,,,
,,,,,pem_5511_kb07,,,,,,,,,,,,,,,,,,,,,,,,,,,,,
,,,,,pem_5511_kb08,,,,,,,,,,,,,,,,,,,,,,,,,,,,,
,,,,,pem_5511_kb09,,,,,,,,,,,,,,,,,,,,,,,,,,,,,
,,,,,pem_5511_kb10,,,,,,,,,,,,,,,,,,,,,,,,,,,,,
,,,,,pem_5511_kb11,,,,,,,,,,,,,,,,,,,,,,,,,,,,,
,,,,,pem_5511_kb12,,,,,,,,,,,,,,,,,,,,,,,,,,,,,
,,,,,pem_5511_kb13,,,,,,,,,,,,,,,,,,,,,,,,,,,,,
,,,,,pem_5511_kb14,,,,,,,,,,,,,,,,,,,,,,,,,,,,,
,,,,,pem_5511_kb15,,,,,,,,,,,,,,,,,,,,,,,,,,,,,
,,,,,pem_5511_kb16,,,,,,,,,,,,,,,,,,,,,,,,,,,,,
,,,,,pem_5511_kb17,,,,,,,,,,,,,,,,,,,,,,,,,,,,,
,,,,,pem_5511_kb18,,,,,,,,,,,,,,,,,,,,,,,,,,,,,
,,,,,pem_5511_kb19,,,,,,,,,,,,,,,,,,,,,,,,,,,,,
,,,,,pem_5511_kb20,,,,,,,,,,,,,,,,,,,,,,,,,,,,,
,,,,,pem_5511_kb21,,,,,,,,,,,,,,,,,,,,,,,,,,,,,
,,,,,pem_5511_kb22,,,,,,,,,,,,,,,,,,,,,,,,,,,,,
,,,,,pem_5511_kb23,,,,,,,,,,,,,,,,,,,,,,,,,,,,,
,,,,,pem_5511_kb24,,,,,,,,,,,,,,,,,,,,,,,,,,,,,
,,,,,pem_5511_kb25,,,,,,,,,,,,,,,,,,,,,,,,,,,,,
,,,,,pem_5511_kb26,,,,,,,,,,,,,,,,,,,,,,,,,,,,,
